BDBM50300843 CHEMBL565976::N-(2-{3-[(3-Fluorophenyl)sulfonyl]-1H-pyrrolo[2,3-b]pyridin-1-yl}ethyl)-N-methylamine
SMILES CNCCn1cc(c2cccnc12)S(=O)(=O)c1cccc(F)c1
InChI Key InChIKey=KXMJOIWHVHUTOI-UHFFFAOYSA-N
Data  1 KI  1 IC50
  Tab Delimited (TSV)   2D SDfile   Computed 3D by Vconf -m prep SDfile
Find this compound or compounds like it in BindingDB:
Activity Spreadsheet -- Enzyme Inhibition Constant Data from BindingDB
Found 2 hits for monomerid = 50300843
Target5-hydroxytryptamine receptor 6(Homo sapiens (Human))
Wyeth Research
Curated by ChEMBL
LigandPNGBDBM50300843(CHEMBL565976 | N-(2-{3-[(3-Fluorophenyl)sulfonyl]-...)
Affinity DataKi:  1nM. Assay description: Displacement of [3H]LSD from human cloned 5HT6 receptor expressed in HeLa cells
In DepthDetails ArticlePubMed
Target5-hydroxytryptamine receptor 6(Homo sapiens (Human))
Wyeth Research
Curated by ChEMBL
LigandPNGBDBM50300843(CHEMBL565976 | N-(2-{3-[(3-Fluorophenyl)sulfonyl]-...)
Affinity DataIC50:  6.20nM. Assay description: Antagonist activity at human cloned 5HT6 receptor expressed in HeLa cells assessed as inhibition of adenylyl cyclase activity by RIA
In DepthDetails ArticlePubMed