BDBM50301969 2a-(aminomethyl)-1-(((S)-2'-oxo-1',2',6,8-tetrahydrospiro[cyclopenta[g]quinoline-7,3'-pyrrolo[2,3-b]pyridine]-2-yl)methyl)-2a,3-dihydropyrrolo[4,3,2-de]quinoline-2,4(1H,5H)-dione::CHEMBL570933
SMILES NCC12CC(=O)Nc3cccc(N(Cc4ccc5cc6C[C@@]7(Cc6cc5n4)C(=O)Nc4ncccc74)C1=O)c23
InChI Key InChIKey=VXHXLQCJVAHSNL-UFXYQILXSA-N
Data  1 KI  1 IC50
  Tab Delimited (TSV)   2D SDfile   Computed 3D by Vconf -m prep SDfile
Find this compound or compounds like it in BindingDB:
Activity Spreadsheet -- Enzyme Inhibition Constant Data from BindingDB
Found 2 hits for monomerid = 50301969
TargetCalcitonin gene-related peptide type 1 receptor(Homo sapiens (Human))
Merck
Curated by ChEMBL
LigandPNGBDBM50301969(2a-(aminomethyl)-1-(((S)-2'-oxo-1',2',6,8-tetrahyd...)
Affinity DataKi:  0.130nM. Assay description: Displacement of [125I]hCGRP from human cloned CGRP receptor expressed in HEK293 cells
In DepthDetails ArticlePubMed
TargetCalcitonin gene-related peptide type 1 receptor(Homo sapiens (Human))
Merck
Curated by ChEMBL
LigandPNGBDBM50301969(2a-(aminomethyl)-1-(((S)-2'-oxo-1',2',6,8-tetrahyd...)
Affinity DataIC50:  0.620nM. Assay description: Antagonist activity at human cloned CGRP receptor expressed in HEK293 cells assessed as inhibition of CGRP-induced cAMP production
In DepthDetails ArticlePubMed