BDBM50301991 2-(6-(3'-(aminomethyl)biphenyl-3-yloxy)-3,5-difluoropyridin-2-yloxy)-4-nitrobenzoic acid::CHEMBL583902
SMILES NCc1cccc(c1)-c1cccc(Oc2nc(Oc3cc(ccc3C(O)=O)[N+]([O-])=O)c(F)cc2F)c1
InChI Key InChIKey=ZJZFGPWURUFMSL-UHFFFAOYSA-N
Data  1 IC50
  Tab Delimited (TSV)   2D SDfile   Computed 3D by Vconf -m prep SDfile
Find this compound or compounds like it in BindingDB:
Activity Spreadsheet -- Enzyme Inhibition Constant Data from BindingDB
Found 1 hit for monomerid = 50301991
TargetUrokinase-type plasminogen activator(Homo sapiens (Human))
Berlex Biosciences
Curated by ChEMBL
LigandPNGBDBM50301991(2-(6-(3'-(aminomethyl)biphenyl-3-yloxy)-3,5-difluo...)
Affinity DataIC50:  1.30E+3nM. Assay description: Inhibition of uPA
In DepthDetails ArticlePubMed