BDBM50302238 CHEMBL566565::N-(3-(3,4-dimethoxyphenyl)-3-(1,3-dioxo-4-(4-((R)-1-phenylethyl)piperazin-1-yl)isoindolin-2-yl)propyl)thiophene-2-sulfonamide
SMILES COc1ccc(cc1OC)C(CCNS(=O)(=O)c1cccs1)N1C(=O)c2cccc(N3CCN(CC3)[C@H](C)c3ccccc3)c2C1=O
InChI Key InChIKey=XWEJKOCDJCMFCN-RIBGEGAISA-N
Data  1 KI  1 IC50
  Tab Delimited (TSV)   2D SDfile   Computed 3D by Vconf -m prep SDfile
Find this compound or compounds like it in BindingDB:
Activity Spreadsheet -- Enzyme Inhibition Constant Data from BindingDB
Found 2 hits for monomerid = 50302238
TargetUrotensin-2 receptor(Homo sapiens (Human))
Johnson & Johnson Pharmaceutical Research & Development
Curated by ChEMBL
LigandPNGBDBM50302238(CHEMBL566565 | N-(3-(3,4-dimethoxyphenyl)-3-(1,3-d...)
Affinity DataKi:  270nM. Assay description: Displacement of [125I]urotensin 2 from urotensin 2 receptor in human RMS13 cells by scintillation proximity assay
In DepthDetails ArticlePubMed
TargetUrotensin-2 receptor(RAT)
Johnson & Johnson Pharmaceutical Research & Development
Curated by ChEMBL
LigandPNGBDBM50302238(CHEMBL566565 | N-(3-(3,4-dimethoxyphenyl)-3-(1,3-d...)
Affinity DataIC50:  120nM. Assay description: Antagonist activity at rat urotensin 2 receptor expressed in CHOK1 cells assessed as inhibition of urotensin 2-induced intracellular calcium mobiliza...
In DepthDetails ArticlePubMed