BDBM50302247 (R)-N-(4-(3,4-dimethoxyphenyl)-4-(1,3-dioxo-4-(piperazin-1-yl)isoindolin-2-yl)butyl)thiophene-2-sulfonamide::CHEMBL566366
SMILES COc1ccc(cc1OC)[C@@H](CCCNS(=O)(=O)c1cccs1)N1C(=O)c2cccc(N3CCNCC3)c2C1=O
InChI Key InChIKey=UWBKABDDTOPLAQ-OAQYLSRUSA-N
Data  1 KI  2 IC50
  Tab Delimited (TSV)   2D SDfile   Computed 3D by Vconf -m prep SDfile
Find this compound or compounds like it in BindingDB:
Activity Spreadsheet -- Enzyme Inhibition Constant Data from BindingDB
Found 3 hits for monomerid = 50302247
TargetUrotensin-2 receptor(Homo sapiens (Human))
Johnson & Johnson Pharmaceutical Research & Development
Curated by ChEMBL
LigandPNGBDBM50302247((R)-N-(4-(3,4-dimethoxyphenyl)-4-(1,3-dioxo-4-(pip...)
Affinity DataKi:  150nM. Assay description: Displacement of [125I]urotensin 2 from urotensin 2 receptor in human RMS13 cells by scintillation proximity assay
In DepthDetails ArticlePubMed
TargetUrotensin-2 receptor(Homo sapiens (Human))
Johnson & Johnson Pharmaceutical Research & Development
Curated by ChEMBL
LigandPNGBDBM50302247((R)-N-(4-(3,4-dimethoxyphenyl)-4-(1,3-dioxo-4-(pip...)
Affinity DataIC50:  500nM. Assay description: Antagonist activity at urotensin 2 receptor in human RMS13 cells assessed as inhibition of urotensin 2-induced intracellular calcium mobilization aft...
In DepthDetails ArticlePubMed
TargetUrotensin-2 receptor(RAT)
Johnson & Johnson Pharmaceutical Research & Development
Curated by ChEMBL
LigandPNGBDBM50302247((R)-N-(4-(3,4-dimethoxyphenyl)-4-(1,3-dioxo-4-(pip...)
Affinity DataIC50:  40nM. Assay description: Antagonist activity at rat urotensin 2 receptor expressed in CHOK1 cells assessed as inhibition of urotensin 2-induced intracellular calcium mobiliza...
In DepthDetails ArticlePubMed