BDBM50302259 (R)-N-(4-(3,4-dimethoxyphenyl)-4-(4-(4-ethylpiperazin-1-yl)-1-oxoisoindolin-2-yl)butyl)thiophene-2-carboxamide::CHEMBL567075
SMILES CCN1CCN(CC1)c1cccc2C(=O)N(Cc12)[C@H](CCCNC(=O)c1cccs1)c1ccc(OC)c(OC)c1
InChI Key InChIKey=DVCVBMAAHFGXPO-RUZDIDTESA-N
Data  1 KI  2 IC50
  Tab Delimited (TSV)   2D SDfile   Computed 3D by Vconf -m prep SDfile
Find this compound or compounds like it in BindingDB:
Activity Spreadsheet -- Enzyme Inhibition Constant Data from BindingDB
Found 3 hits for monomerid = 50302259
TargetUrotensin-2 receptor(Homo sapiens (Human))
Johnson & Johnson Pharmaceutical Research & Development
Curated by ChEMBL
LigandPNGBDBM50302259((R)-N-(4-(3,4-dimethoxyphenyl)-4-(4-(4-ethylpipera...)
Affinity DataKi:  18nM. Assay description: Displacement of [125I]urotensin 2 from urotensin 2 receptor in human RMS13 cells by scintillation proximity assay
In DepthDetails ArticlePubMed
TargetUrotensin-2 receptor(Homo sapiens (Human))
Johnson & Johnson Pharmaceutical Research & Development
Curated by ChEMBL
LigandPNGBDBM50302259((R)-N-(4-(3,4-dimethoxyphenyl)-4-(4-(4-ethylpipera...)
Affinity DataIC50:  140nM. Assay description: Antagonist activity at urotensin 2 receptor in human RMS13 cells assessed as inhibition of urotensin 2-induced intracellular calcium mobilization aft...
In DepthDetails ArticlePubMed
TargetUrotensin-2 receptor(RAT)
Johnson & Johnson Pharmaceutical Research & Development
Curated by ChEMBL
LigandPNGBDBM50302259((R)-N-(4-(3,4-dimethoxyphenyl)-4-(4-(4-ethylpipera...)
Affinity DataIC50:  7nM. Assay description: Antagonist activity at rat urotensin 2 receptor expressed in CHOK1 cells assessed as inhibition of urotensin 2-induced intracellular calcium mobiliza...
In DepthDetails ArticlePubMed