BDBM50302591 1-(4-methoxy-2-methylphenyl)-3,6-dimethyl-N-(2-((propylamino)methyl)-1H-imidazol-1-yl)-1H-pyrazolo[3,4-d]pyrimidin-4-amine::CHEMBL567741
SMILES CCCNCc1nccn1Nc1nc(C)nc2n(nc(C)c12)-c1ccc(OC)cc1C
InChI Key InChIKey=OHIYLHCMVNOIHY-UHFFFAOYSA-N
Data  1 KI
  Tab Delimited (TSV)   2D SDfile   Computed 3D by Vconf -m prep SDfile
Find this compound or compounds like it in BindingDB:
Activity Spreadsheet -- Enzyme Inhibition Constant Data from BindingDB
Found 1 hit for monomerid = 50302591
TargetCorticotropin-releasing factor receptor 1(Homo sapiens (Human))
Pfizer
Curated by ChEMBL
LigandPNGBDBM50302591(1-(4-methoxy-2-methylphenyl)-3,6-dimethyl-N-(2-((p...)
Affinity DataKi:  400nM. Assay description: Antagonist activity at human recombinant CRF1 receptor expressed in CHO cells assessed as inhibition of CRF-induced cAMP production
In DepthDetails ArticlePubMed