BDBM50303259 ((1S,3'R,4'S,5'S,6'R)-5-chloro-4-(4-ethylbenzyl)-3',4',5'-trihydroxy-3',4',5',6'-tetrahydro-3H-spiro[isobenzofuran-1,2'-pyran]-6'-yl)methyl acetate::CHEMBL565786
SMILES CCc1ccc(Cc2c3CO[C@]4(O[C@H](COC(C)=O)[C@@H](O)[C@H](O)[C@H]4O)c3ccc2Cl)cc1
InChI Key InChIKey=NYWJAYGVVLWKPQ-SJSRKZJXSA-N
Data  2 IC50
  Tab Delimited (TSV)   2D SDfile   Computed 3D by Vconf -m prep SDfile
Find this compound or compounds like it in BindingDB:
Activity Spreadsheet -- Enzyme Inhibition Constant Data from BindingDB
Found 2 hits for monomerid = 50303259
TargetSodium/glucose cotransporter 2(Homo sapiens (Human))
Chinese Academy Of Sciences
Curated by ChEMBL
LigandPNGBDBM50303259(((1S,3'R,4'S,5'S,6'R)-5-chloro-4-(4-ethylbenzyl)-3...)
Affinity DataIC50:  43nM. Assay description: Inhibition of human SGLT2 transfected in HEK293.ETN cells assessed as AMG uptake after 1.5 hrs by scintillation counting
In DepthDetails ArticlePubMed
TargetSodium/glucose cotransporter 1(Homo sapiens (Human))
Chinese Academy Of Sciences
Curated by ChEMBL
LigandPNGBDBM50303259(((1S,3'R,4'S,5'S,6'R)-5-chloro-4-(4-ethylbenzyl)-3...)
Affinity DataIC50:  3.50E+3nM. Assay description: Inhibition of human SGLT1 transfected in COS-7 cells assessed as AMG uptake after 2 hrs by scintillation counting
In DepthDetails ArticlePubMed