BDBM50303921 4-(methylamino)naphthalen-1-ol::CHEMBL571240
SMILES CNc1ccc(O)c2ccccc12
InChI Key InChIKey=YEJJUWPHXGQPCZ-UHFFFAOYSA-N
Data  1 IC50
  Tab Delimited (TSV)   2D SDfile   Computed 3D by Vconf -m prep SDfile
Find this compound or compounds like it in BindingDB:
Activity Spreadsheet -- Enzyme Inhibition Constant Data from BindingDB
Found 1 hit for monomerid = 50303921
TargetIndoleamine 2,3-dioxygenase 1(Homo sapiens (Human))
Institute For Cancer Research
Curated by ChEMBL
LigandPNGBDBM50303921(4-(methylamino)naphthalen-1-ol | CHEMBL571240)
Affinity DataIC50:  1.25E+4nM. Assay description: Inhibition of human recombinant IDO expressed in Escherichia coli BL21 AI
In DepthDetails ArticlePubMed