BDBM50304846 4-(4-aminophenyl)-1,2-dimethyl-5-(quinoxalin-6-yl)-1H-pyrazol-3(2H)-one::CHEMBL594372
SMILES Cn1c(c(-c2ccc(N)cc2)c(=O)n1C)-c1ccc2nccnc2c1
InChI Key InChIKey=UTZMVQQFBWCFDJ-UHFFFAOYSA-N
Data  1 KI
  Tab Delimited (TSV)   2D SDfile   Computed 3D by Vconf -m prep SDfile
Find this compound or compounds like it in BindingDB:
Activity Spreadsheet -- Enzyme Inhibition Constant Data from BindingDB
Found 1 hit for monomerid = 50304846
TargetTGF-beta receptor type-1(Homo sapiens (Human))
Biogen Idec
Curated by ChEMBL
LigandPNGBDBM50304846(4-(4-aminophenyl)-1,2-dimethyl-5-(quinoxalin-6-yl)...)
Affinity DataKi:  6.40E+5nM. Assay description: Displacement of [3H]HTS446284 from human recombinant His-tagged TGFbetaR1 after 1 hr by scintillation counting
In DepthDetails ArticlePubMed