BDBM50305115 5-(4'-cyanobiphenyl-4-yloxy)-N-hydroxypentanamide::CHEMBL591321
SMILES ONC(=O)CCCCOc1ccc(cc1)-c1ccc(cc1)C#N
InChI Key InChIKey=AJPODVJJWNQXJU-UHFFFAOYSA-N
Data  2 Kd
  Tab Delimited (TSV)   2D SDfile   Computed 3D by Vconf -m prep SDfile
Find this compound or compounds like it in BindingDB:
Activity Spreadsheet -- Enzyme Inhibition Constant Data from BindingDB
Found 2 hits for monomerid = 50305115
TargetStromelysin-1(Homo sapiens (Human))
Duke University
Curated by ChEMBL
LigandPNGBDBM50305115(5-(4'-cyanobiphenyl-4-yloxy)-N-hydroxypentanamide ...)
Affinity DataKd:  1.70E+4nM. Assay description: Binding affinity to stromelysin-1 catalytic domain expressed in Escherichia coli BL21 (DE3) by isothermal titration colorimetry
In DepthDetails ArticlePubMed
TargetStromelysin-1(Homo sapiens (Human))
Duke University
Curated by ChEMBL
LigandPNGBDBM50305115(5-(4'-cyanobiphenyl-4-yloxy)-N-hydroxypentanamide ...)
Affinity DataKd:  1.10E+4nM. Assay description: Binding affinity to stromelysin-1 catalytic domain
In DepthDetails ArticlePubMed