BDBM50306559 CHEMBL602485::[1-(beta-D-Gluco-hept-2-ulopyranosyl)-4-(2-naphthyl)-1,2,3-triazole]onamide
SMILES NC(=O)[C@]1(O[C@H](CO)[C@@H](O)[C@H](O)[C@H]1O)n1cc(nn1)-c1ccc2ccccc2c1
InChI Key InChIKey=HKEJAYVVICGLBF-ILYVXUQDSA-N
Data  1 IC50
  Tab Delimited (TSV)   2D SDfile   Computed 3D by Vconf -m prep SDfile
Find this compound or compounds like it in BindingDB:
Activity Spreadsheet -- Enzyme Inhibition Constant Data from BindingDB
Found 1 hit for monomerid = 50306559
TargetGlycogen phosphorylase, muscle form(Oryctolagus cuniculus (rabbit))
University Of Debrecen
Curated by ChEMBL
LigandPNGBDBM50306559(CHEMBL602485 | [1-(beta-D-Gluco-hept-2-ulopyranosy...)
Affinity DataIC50:  7.80E+5nM. Assay description: Inhibition of rabbit skeletal muscle glycogen phosphorylase b by Lineweaver-Burk plot analysis
In DepthDetails ArticlePubMed