BDBM50307336 6-Benzyloxybenzo[b]thiophene-2-carboxamidine::CHEMBL598170
SMILES NC(=N)c1cc2cc(ccc2s1)-c1cccc(OCc2ccccc2)c1
InChI Key InChIKey=HCMFEDPYXOWDMW-UHFFFAOYSA-N
Data  2 KI
  Tab Delimited (TSV)   2D SDfile   Computed 3D by Vconf -m prep SDfile
Find this compound or compounds like it in BindingDB:
Activity Spreadsheet -- Enzyme Inhibition Constant Data from BindingDB
Found 2 hits for monomerid = 50307336
TargetCoagulation factor IX(Homo sapiens (Human))
Trigen
Curated by ChEMBL
LigandPNGBDBM50307336(6-Benzyloxybenzo[b]thiophene-2-carboxamidine | CHE...)
Affinity DataKi:  3.80E+3nM. Assay description: Inhibition of human recombinant factor 9a by amidolytic assay
In DepthDetails ArticlePubMed
TargetCoagulation factor X(Homo sapiens (Human))
Trigen
Curated by ChEMBL
LigandPNGBDBM50307336(6-Benzyloxybenzo[b]thiophene-2-carboxamidine | CHE...)
Affinity DataKi:  1.48E+4nM. Assay description: Inhibition of factor 10 by amidolytic assay
In DepthDetails ArticlePubMed