BDBM50307337 (2-Carbamimidoyl-benzo[b]thiophen-6-yloxy)-acetic acid ethyl ester::CHEMBL598383
SMILES CCOC(=O)COc1cccc(c1)-c1ccc2sc(cc2c1)C(N)=N
InChI Key InChIKey=AAQMRULHDUDGMM-UHFFFAOYSA-N
Data  2 KI
  Tab Delimited (TSV)   2D SDfile   Computed 3D by Vconf -m prep SDfile
Find this compound or compounds like it in BindingDB:
Activity Spreadsheet -- Enzyme Inhibition Constant Data from BindingDB
Found 2 hits for monomerid = 50307337
TargetCoagulation factor X(Homo sapiens (Human))
Trigen
Curated by ChEMBL
LigandPNGBDBM50307337((2-Carbamimidoyl-benzo[b]thiophen-6-yloxy)-acetic ...)
Affinity DataKi:  600nM. Assay description: Inhibition of factor 10 by amidolytic assay
In DepthDetails ArticlePubMed
TargetCoagulation factor IX(Homo sapiens (Human))
Trigen
Curated by ChEMBL
LigandPNGBDBM50307337((2-Carbamimidoyl-benzo[b]thiophen-6-yloxy)-acetic ...)
Affinity DataKi:  3.80E+3nM. Assay description: Inhibition of human recombinant factor 9a by amidolytic assay
In DepthDetails ArticlePubMed