BDBM50307340 6-(3-Chloro-benzyloxy)-benzo[b]thiophene-2-carboxamidine::CHEMBL597574
SMILES NC(=N)c1cc2cc(ccc2s1)-c1cccc(OCc2cccc(Cl)c2)c1
InChI Key InChIKey=KLSYBMLSGSWECV-UHFFFAOYSA-N
Data  2 KI
  Tab Delimited (TSV)   2D SDfile   Computed 3D by Vconf -m prep SDfile
Find this compound or compounds like it in BindingDB:
Activity Spreadsheet -- Enzyme Inhibition Constant Data from BindingDB
Found 2 hits for monomerid = 50307340
TargetCoagulation factor IX(Homo sapiens (Human))
Trigen
Curated by ChEMBL
LigandPNGBDBM50307340(6-(3-Chloro-benzyloxy)-benzo[b]thiophene-2-carboxa...)
Affinity DataKi:  900nM. Assay description: Inhibition of human recombinant factor 9a by amidolytic assay
In DepthDetails ArticlePubMed
TargetCoagulation factor X(Homo sapiens (Human))
Trigen
Curated by ChEMBL
LigandPNGBDBM50307340(6-(3-Chloro-benzyloxy)-benzo[b]thiophene-2-carboxa...)
Affinity DataKi:  4.30E+3nM. Assay description: Inhibition of factor 10 by amidolytic assay
In DepthDetails ArticlePubMed