BDBM50307341 6-(4-Chloro-benzyloxy)-benzo[b]thiophene-2-carboxamidine::CHEMBL597575
SMILES NC(=N)c1cc2cc(ccc2s1)-c1cccc(OCc2ccc(Cl)cc2)c1
InChI Key InChIKey=NMIDQZURHAQFLL-UHFFFAOYSA-N
Data  2 KI
  Tab Delimited (TSV)   2D SDfile   Computed 3D by Vconf -m prep SDfile
Find this compound or compounds like it in BindingDB:
Activity Spreadsheet -- Enzyme Inhibition Constant Data from BindingDB
Found 2 hits for monomerid = 50307341
TargetCoagulation factor IX(Homo sapiens (Human))
Trigen
Curated by ChEMBL
LigandPNGBDBM50307341(6-(4-Chloro-benzyloxy)-benzo[b]thiophene-2-carboxa...)
Affinity DataKi:  450nM. Assay description: Inhibition of human recombinant factor 9a by amidolytic assay
In DepthDetails ArticlePubMed
TargetCoagulation factor X(Homo sapiens (Human))
Trigen
Curated by ChEMBL
LigandPNGBDBM50307341(6-(4-Chloro-benzyloxy)-benzo[b]thiophene-2-carboxa...)
Affinity DataKi:  2.90E+3nM. Assay description: Inhibition of factor 10 by amidolytic assay
In DepthDetails ArticlePubMed