BDBM50307342 6-(3-Methoxy-benzyloxy)-benzo[b]thiophene-2-carboxamidine::CHEMBL599627
SMILES COc1cccc(COc2cccc(c2)-c2ccc3sc(cc3c2)C(N)=N)c1
InChI Key InChIKey=NHKAFDQMSZHTJW-UHFFFAOYSA-N
Data  2 KI
  Tab Delimited (TSV)   2D SDfile   Computed 3D by Vconf -m prep SDfile
Find this compound or compounds like it in BindingDB:
Activity Spreadsheet -- Enzyme Inhibition Constant Data from BindingDB
Found 2 hits for monomerid = 50307342
TargetCoagulation factor IX(Homo sapiens (Human))
Trigen
Curated by ChEMBL
LigandPNGBDBM50307342(6-(3-Methoxy-benzyloxy)-benzo[b]thiophene-2-carbox...)
Affinity DataKi:  450nM. Assay description: Inhibition of human recombinant factor 9a by amidolytic assay
In DepthDetails ArticlePubMed
TargetCoagulation factor X(Homo sapiens (Human))
Trigen
Curated by ChEMBL
LigandPNGBDBM50307342(6-(3-Methoxy-benzyloxy)-benzo[b]thiophene-2-carbox...)
Affinity DataKi:  4.30E+3nM. Assay description: Inhibition of factor 10 by amidolytic assay
In DepthDetails ArticlePubMed