BDBM50307343 6-(4-Methoxy-benzyloxy)-benzo[b]thiophene-2-carboxamidine::CHEMBL599628
SMILES COc1ccc(COc2cccc(c2)-c2ccc3sc(cc3c2)C(N)=N)cc1
InChI Key InChIKey=HITBRYNXUXSMAE-UHFFFAOYSA-N
Data  2 KI
  Tab Delimited (TSV)   2D SDfile   Computed 3D by Vconf -m prep SDfile
Find this compound or compounds like it in BindingDB:
Activity Spreadsheet -- Enzyme Inhibition Constant Data from BindingDB
Found 2 hits for monomerid = 50307343
TargetCoagulation factor IX(Homo sapiens (Human))
Trigen
Curated by ChEMBL
LigandPNGBDBM50307343(6-(4-Methoxy-benzyloxy)-benzo[b]thiophene-2-carbox...)
Affinity DataKi:  250nM. Assay description: Inhibition of human recombinant factor 9a by amidolytic assay
In DepthDetails ArticlePubMed
TargetCoagulation factor X(Homo sapiens (Human))
Trigen
Curated by ChEMBL
LigandPNGBDBM50307343(6-(4-Methoxy-benzyloxy)-benzo[b]thiophene-2-carbox...)
Affinity DataKi:  1.31E+4nM. Assay description: Inhibition of factor 10 by amidolytic assay
In DepthDetails ArticlePubMed