BDBM50307344 6-(4-Methyl-benzyloxy)-benzo[b]thiophene-2-carboxamidine::CHEMBL609324
SMILES Cc1ccc(COc2cccc(c2)-c2ccc3sc(cc3c2)C(N)=N)cc1
InChI Key InChIKey=VYPHWRAGHDTBJR-UHFFFAOYSA-N
Data  2 KI
  Tab Delimited (TSV)   2D SDfile   Computed 3D by Vconf -m prep SDfile
Find this compound or compounds like it in BindingDB:
Activity Spreadsheet -- Enzyme Inhibition Constant Data from BindingDB
Found 2 hits for monomerid = 50307344
TargetCoagulation factor IX(Homo sapiens (Human))
Trigen
Curated by ChEMBL
LigandPNGBDBM50307344(6-(4-Methyl-benzyloxy)-benzo[b]thiophene-2-carboxa...)
Affinity DataKi:  900nM. Assay description: Inhibition of human recombinant factor 9a by amidolytic assay
In DepthDetails ArticlePubMed
TargetCoagulation factor X(Homo sapiens (Human))
Trigen
Curated by ChEMBL
LigandPNGBDBM50307344(6-(4-Methyl-benzyloxy)-benzo[b]thiophene-2-carboxa...)
Affinity DataKi:  7.90E+3nM. Assay description: Inhibition of factor 10 by amidolytic assay
In DepthDetails ArticlePubMed