BDBM50307351 6-(2-Methoxy-benzyloxy)-benzo[b]thiophene-2-carboxamidine::CHEMBL599626
SMILES COc1ccccc1COc1cccc(c1)-c1ccc2sc(cc2c1)C(N)=N
InChI Key InChIKey=QUEVYPXEDCTYEO-UHFFFAOYSA-N
Data  1 KI
  Tab Delimited (TSV)   2D SDfile   Computed 3D by Vconf -m prep SDfile
Find this compound or compounds like it in BindingDB:
Activity Spreadsheet -- Enzyme Inhibition Constant Data from BindingDB
Found 1 hit for monomerid = 50307351
TargetCoagulation factor IX(Homo sapiens (Human))
Trigen
Curated by ChEMBL
LigandPNGBDBM50307351(6-(2-Methoxy-benzyloxy)-benzo[b]thiophene-2-carbox...)
Affinity DataKi:  2.69E+4nM. Assay description: Inhibition of human recombinant factor 9a by amidolytic assay
In DepthDetails ArticlePubMed