BDBM50309229 6-(3-(4-(2-(dimethylamino)-2-methylpropanoyl)piperazine-1-carbonyl)-4-fluorobenzyl)-4,5-dimethylpyridazin-3(2H)-one::CHEMBL605575
SMILES CN(C)C(C)(C)C(=O)N1CCN(CC1)C(=O)c1cc(Cc2n[nH]c(=O)c(C)c2C)ccc1F
InChI Key InChIKey=MNGQRBJYINPKBW-UHFFFAOYSA-N
Data  1 IC50
  Tab Delimited (TSV)   2D SDfile   Computed 3D by Vconf -m prep SDfile
Find this compound or compounds like it in BindingDB:
Activity Spreadsheet -- Enzyme Inhibition Constant Data from BindingDB
Found 1 hit for monomerid = 50309229
TargetPoly [ADP-ribose] polymerase 1(Homo sapiens (Human))
Merck Research Laboratories
Curated by ChEMBL
LigandPNGBDBM50309229(6-(3-(4-(2-(dimethylamino)-2-methylpropanoyl)piper...)
Affinity DataIC50:  1.80nM. Assay description: Inhibition of PARP1
In DepthDetails ArticlePubMed