BDBM50309476 (2R,3R,4S,5S)-2-(6-amino-2-((S)-1-hydroxy-3-phenylpropan-2-ylamino)-9H-purin-9-yl)-5-(1H-indazol-1-yl)tetrahydrofuran-3,4-diol::CHEMBL605778
SMILES Nc1nc(N[C@H](CO)Cc2ccccc2)nc2n(cnc12)[C@@H]1C[C@@H]([C@@H](O)[C@H]1O)n1ncc2ccccc12
InChI Key InChIKey=UWBKGMMHEWTZJY-YFVPBJFGSA-N
Data  1 KI
  Tab Delimited (TSV)   2D SDfile   Computed 3D by Vconf -m prep SDfile
Find this compound or compounds like it in BindingDB:
Activity Spreadsheet -- Enzyme Inhibition Constant Data from BindingDB
Found 1 hit for monomerid = 50309476
TargetAdenosine receptor A2a(Homo sapiens (Human))
Novartis Institutes For Biomedical Research
Curated by ChEMBL
LigandPNGBDBM50309476((2R,3R,4S,5S)-2-(6-amino-2-((S)-1-hydroxy-3-phenyl...)
Affinity DataKi:  5.41E+3nM. Assay description: Displacement of [3H]NECA from human recombinant adenosine A2A receptor expressed in Sf21 cells co-expressing GalphaS2, beta4, gamma2
In DepthDetails ArticlePubMed