BDBM50309783 (1S,2R,3S,4R,5S)-6-(3-Chlorobenzylamino)-4-(2-(6-(4-(2-bromoacetyl)phenyl)-1H-1,2,3-triazol-4-yl)hex-1-ynyl)-9H-purin-9-yl)-2',3'-dihydroxybicyclo[3.1.0]hexane-1'-carboxylic acid N-methylamide::CHEMBL602845
SMILES CNC(=O)[C@@]12C[C@@H]1[C@H]([C@H](O)[C@@H]2O)n1cnc2c(NCc3cccc(Cl)c3)nc(nc12)C#CCCCCc1cn(nn1)C(Br)C(=O)c1ccccc1
InChI Key InChIKey=SJKQMHPNHNRFGL-IXWQHHIZSA-N
Data  2 KI
  Tab Delimited (TSV)   2D SDfile   Computed 3D by Vconf -m prep SDfile
Find this compound or compounds like it in BindingDB:
Activity Spreadsheet -- Enzyme Inhibition Constant Data from BindingDB
Found 2 hits for monomerid = 50309783
TargetAdenosine receptor A3(Homo sapiens (Human))
Niddk
Curated by ChEMBL
LigandPNGBDBM50309783((1S,2R,3S,4R,5S)-6-(3-Chlorobenzylamino)-4-(2-(6-(...)
Affinity DataKi:  9.60nM. Assay description: Displacement of [3H]I-AB-MECA from human recombinant adenosine A3 receptor expressed in CHO cells by liquid scintillation counting
In DepthDetails ArticlePubMed
TargetAdenosine receptor A2a(Homo sapiens (Human))
Niddk
Curated by ChEMBL
LigandPNGBDBM50309783((1S,2R,3S,4R,5S)-6-(3-Chlorobenzylamino)-4-(2-(6-(...)
Affinity DataKi:  5.74E+3nM. Assay description: Displacement of [3H]CGS21680 from human recombinant adenosine A2A receptor expressed in HEK293 cells by liquid scintillation counting
In DepthDetails ArticlePubMed