BDBM50309845 (S)-1,3'-bipyrrolidin-1'-yl(4-((1H-benzo[d]imidazol-1-yl)methyl)phenyl)methanone::CHEMBL599589
SMILES O=C(N1CC[C@@H](C1)N1CCCC1)c1ccc(Cn2cnc3ccccc23)cc1
InChI Key InChIKey=NUVVLNOBNYNPKB-FQEVSTJZSA-N
Data  2 KI
  Tab Delimited (TSV)   2D SDfile   Computed 3D by Vconf -m prep SDfile
Find this compound or compounds like it in BindingDB:
Activity Spreadsheet -- Enzyme Inhibition Constant Data from BindingDB
Found 2 hits for monomerid = 50309845
TargetHistamine H3 receptor(Homo sapiens (Human))
Pfizer
Curated by ChEMBL
LigandPNGBDBM50309845((S)-1,3'-bipyrrolidin-1'-yl(4-((1H-benzo[d]imidazo...)
Affinity DataKi:  10nM. Assay description: Displacement of [3H]-(R)alpha-methylhistamine from human histamine H3 receptor expressed in human HEK293T cells
In DepthDetails ArticlePubMed
TargetHistamine H3 receptor(Homo sapiens (Human))
Pfizer
Curated by ChEMBL
LigandPNGBDBM50309845((S)-1,3'-bipyrrolidin-1'-yl(4-((1H-benzo[d]imidazo...)
Affinity DataKi:  10nM. Assay description: Displacement of [3H](R)-alpha-methylhistamine from human cloned histamine H3 receptor expressed in HEK293T cells by liquid scintillation spectrometry
In DepthDetails ArticlePubMed