BDBM50310642 4-(3-(5-tert-butylisoxazol-3-yl)ureido)-N-(pyridin-3-yl)benzamide::CHEMBL1080783
SMILES CC(C)(C)c1cc(NC(=O)Nc2ccc(cc2)C(=O)Nc2cccnc2)no1
InChI Key InChIKey=OOFUZZCWBWCQCK-UHFFFAOYSA-N
Data  1 Kd
  Tab Delimited (TSV)   2D SDfile   Computed 3D by Vconf -m prep SDfile
Find this compound or compounds like it in BindingDB:
Activity Spreadsheet -- Enzyme Inhibition Constant Data from BindingDB
Found 1 hit for monomerid = 50310642
TargetReceptor-type tyrosine-protein kinase FLT3(Homo sapiens (Human))
Ambit Biosciences
Curated by ChEMBL
LigandPNGBDBM50310642(4-(3-(5-tert-butylisoxazol-3-yl)ureido)-N-(pyridin...)
Affinity DataKd:  25nM. Assay description: Binding affinity to FLT3
In DepthDetails ArticlePubMed