BDBM50312894 3alpha,8-dimethyl-1-phenethyl-1,2,3,3alpha,8,8alpha-hexahydropyrrolo[2,3-b]indol-5-yl4-tert-butylphenylcarbamate::CHEMBL1080387
SMILES CN1[C@H]2N(CCc3ccccc3)CC[C@@]2(C)c2cc(OC(=O)Nc3ccc(cc3)C(C)(C)C)ccc12
InChI Key InChIKey=XYIWCLMRECCCLF-IZEXYCQBSA-N
Data  2 IC50
  Tab Delimited (TSV)   2D SDfile   Computed 3D by Vconf -m prep SDfile
Find this compound or compounds like it in BindingDB:
Activity Spreadsheet -- Enzyme Inhibition Constant Data from BindingDB
Found 2 hits for monomerid = 50312894
TargetAcetylcholinesterase(Mus musculus (mouse))
Kyoto University
Curated by ChEMBL
LigandPNGBDBM50312894(3alpha,8-dimethyl-1-phenethyl-1,2,3,3alpha,8,8alph...)
Affinity DataIC50:  1.50E+4nM. Assay description: Inhibition of mouse brain AChE after 1 hr by modified Ellman's colorimetric method
In DepthDetails ArticlePubMed
TargetCholinesterase(Mus musculus (Mouse))
Kyoto University
Curated by ChEMBL
LigandPNGBDBM50312894(3alpha,8-dimethyl-1-phenethyl-1,2,3,3alpha,8,8alph...)
Affinity DataIC50:  430nM. Assay description: Inhibition of mouse serum BChE after 1 hr by modified Ellman's colorimetric method
In DepthDetails ArticlePubMed