BDBM50313052 (Z)-3-(4-methoxyphenyl)-4-(2-(pyridin-4-yl)hydrazono)-1H-pyrazol-5(4H)-one::CHEMBL1081069
SMILES COc1ccc(cc1)-c1[nH][nH]c(=O)c1N=Nc1ccncc1
InChI Key InChIKey=FQLQOUWGMKHNNC-UHFFFAOYSA-N
Data  1 KI
  Tab Delimited (TSV)   2D SDfile   Computed 3D by Vconf -m prep SDfile
Find this compound or compounds like it in BindingDB:
Activity Spreadsheet -- Enzyme Inhibition Constant Data from BindingDB
Found 1 hit for monomerid = 50313052
TargetGlycogen synthase kinase-3 beta(Homo sapiens (Human))
Vertex Pharmaceuticals
Curated by ChEMBL
LigandPNGBDBM50313052((Z)-3-(4-methoxyphenyl)-4-(2-(pyridin-4-yl)hydrazo...)
Affinity DataKi:  14nM. Assay description: Inhibition of GSK3-beta assessed as NADH level after 10 mins by pyruvate kinase/lactate dehydrogenase coupled spectrophotometric assay
In DepthDetails ArticlePubMed