BDBM50316878 2-amino-8-(4-ethylpiperazine-1-carbonyl)-4-phenyl-5H-indeno[1,2-d]pyrimidin-5-one::CHEMBL1087084
SMILES CCN1CCN(CC1)C(=O)c1ccc2C(=O)c3c(nc(N)nc3-c3ccccc3)-c2c1
InChI Key InChIKey=PUDOIQALSBSGES-UHFFFAOYSA-N
Data  2 KI
  Tab Delimited (TSV)   2D SDfile   Computed 3D by Vconf -m prep SDfile
Find this compound or compounds like it in BindingDB:
Activity Spreadsheet -- Enzyme Inhibition Constant Data from BindingDB
Found 2 hits for monomerid = 50316878
TargetAdenosine receptor A2a(Homo sapiens (Human))
Johnson & Johnson Pharmaceutical Research And Development
Curated by ChEMBL
LigandPNGBDBM50316878(2-amino-8-(4-ethylpiperazine-1-carbonyl)-4-phenyl-...)
Affinity DataKi:  14.9nM. Assay description: Antagonistic activity at adenosine A2A receptor
In DepthDetails ArticlePubMed
TargetAdenosine receptor A1(Homo sapiens (Human))
Johnson & Johnson Pharmaceutical Research And Development
Curated by ChEMBL
LigandPNGBDBM50316878(2-amino-8-(4-ethylpiperazine-1-carbonyl)-4-phenyl-...)
Affinity DataKi:  67.4nM. Assay description: Antagonistic activity at adenosine A1 receptor
In DepthDetails ArticlePubMed