BDBM50316965 CHEMBL1086960::N'-cyano-N-(3-(4-(pyrimidin-2-yl)piperazin-1-yl)propyl)isonicotinamidine
SMILES N#CNC(=NCCCN1CCN(CC1)c1ncccn1)c1ccncc1
InChI Key InChIKey=HUJGLUATIHCVBB-UHFFFAOYSA-N
Data  1 KI
  Tab Delimited (TSV)   2D SDfile   Computed 3D by Vconf -m prep SDfile
Find this compound or compounds like it in BindingDB:
Activity Spreadsheet -- Enzyme Inhibition Constant Data from BindingDB
Found 1 hit for monomerid = 50316965
Target5-hydroxytryptamine receptor 1A(Rattus norvegicus (rat))
Universit£
Curated by ChEMBL
LigandPNGBDBM50316965(CHEMBL1086960 | N'-cyano-N-(3-(4-(pyrimidin-2-yl)p...)
Affinity DataKi:  172nM. Assay description: Displacement of [3H]-8-OH-DPAT from 5-HT1A receptor in Sprague-Dawley rat brain cortex after 30 mins liquid scintillation spectrometer
In DepthDetails ArticlePubMed