BDBM50316972 CHEMBL1087318::N'-cyano-N-(3-(4-(2-cyanophenyl)piperazin-1-yl)propyl)isonicotinamidine
SMILES N#CNC(=NCCCN1CCN(CC1)c1ccccc1C#N)c1ccncc1
InChI Key InChIKey=MHPWJCQXRJVFIR-UHFFFAOYSA-N
Data  1 KI
  Tab Delimited (TSV)   2D SDfile   Computed 3D by Vconf -m prep SDfile
Find this compound or compounds like it in BindingDB:
Activity Spreadsheet -- Enzyme Inhibition Constant Data from BindingDB
Found 1 hit for monomerid = 50316972
Target5-hydroxytryptamine receptor 2A(Rattus norvegicus (rat))
Universit£
Curated by ChEMBL
LigandPNGBDBM50316972(CHEMBL1087318 | N'-cyano-N-(3-(4-(2-cyanophenyl)pi...)
Affinity DataKi: >1.00E+4nM. Assay description: Displacement of [3H]ketanserin hydrochloride from 5-HT2A receptor in Sprague-Dawley rat brain cortex after 15 mins
In DepthDetails ArticlePubMed