BDBM50317734 3-methyl-4-(4'-(methylsulfonyl)biphenyl-3-yl)-8-(trifluoromethyl)quinoline::CHEMBL1094742
SMILES Cc1cnc2c(cccc2c1-c1cccc(c1)-c1ccc(cc1)S(C)(=O)=O)C(F)(F)F
InChI Key InChIKey=AWHRFIKOWGDBRL-UHFFFAOYSA-N
Data  2 IC50
  Tab Delimited (TSV)   2D SDfile   Computed 3D by Vconf -m prep SDfile
Find this compound or compounds like it in BindingDB:
Activity Spreadsheet -- Enzyme Inhibition Constant Data from BindingDB
Found 2 hits for monomerid = 50317734
TargetOxysterols receptor LXR-alpha(Homo sapiens (Human))
Wyeth Pharmaceuticals
Curated by ChEMBL
LigandPNGBDBM50317734(3-methyl-4-(4'-(methylsulfonyl)biphenyl-3-yl)-8-(t...)
Affinity DataIC50: >1.00E+3nM. Assay description: Displacement of [3H]T0901317 from LXRalpha ligand binding domain
In DepthDetails ArticlePubMed
TargetOxysterols receptor LXR-beta(Homo sapiens (Human))
Wyeth Pharmaceuticals
Curated by ChEMBL
LigandPNGBDBM50317734(3-methyl-4-(4'-(methylsulfonyl)biphenyl-3-yl)-8-(t...)
Affinity DataIC50:  355nM. Assay description: Displacement of [3H]T0901317 from LXRbeta ligand binding domain
In DepthDetails ArticlePubMed