BDBM50319800 (3-methoxy-4-(naphthalen-1-yl)phenyl)((1S,5R)-1,3,3-trimethyl-6-azabicyclo[3.2.1]octan-6-yl)methanone::CHEMBL1084111
SMILES COc1cc(ccc1-c1cccc2ccccc12)C(=O)N1C[C@]2(C)C[C@H]1CC(C)(C)C2
InChI Key InChIKey=YBMKUIPFJVPTQV-LYZGTLIUSA-N
Data  2 KI
  Tab Delimited (TSV)   2D SDfile   Computed 3D by Vconf -m prep SDfile
Find this compound or compounds like it in BindingDB:
Activity Spreadsheet -- Enzyme Inhibition Constant Data from BindingDB
Found 2 hits for monomerid = 50319800
TargetVasopressin V1a receptor(Homo sapiens (Human))
Pfizer
Curated by ChEMBL
LigandPNGBDBM50319800((3-methoxy-4-(naphthalen-1-yl)phenyl)((1S,5R)-1,3,...)
Affinity DataKi:  5.40nM. Assay description: Displacement [3H]Arg human recombinant Vasopressin V1a receptor
In DepthDetails ArticlePubMed
TargetVasopressin V2 receptor(Homo sapiens (Human))
Pfizer
Curated by ChEMBL
LigandPNGBDBM50319800((3-methoxy-4-(naphthalen-1-yl)phenyl)((1S,5R)-1,3,...)
Affinity DataKi:  63nM. Assay description: Displacement [3H]Arg human recombinant Vasopressin V2 receptor
In DepthDetails ArticlePubMed