BDBM50320469 Ac-[CFWKFC]-NH2::CHEMBL1163471
SMILES CC(=O)N[C@H]1CSSC[C@H](NC(=O)[C@H](Cc2ccccc2)NC(=O)[C@H](CCCCN)NC(=O)[C@H](Cc2c[nH]c3ccccc23)NC(=O)[C@H](Cc2ccccc2)NC1=O)C(N)=O
InChI Key InChIKey=PRZDRTMXFMEFAP-DUGSHLAESA-N
Data  1 KI  1 EC50
  Tab Delimited (TSV)   2D SDfile   Computed 3D by Vconf -m prep SDfile
Find this compound or compounds like it in BindingDB:
Activity Spreadsheet -- Enzyme Inhibition Constant Data from BindingDB
Found 2 hits for monomerid = 50320469
TargetUrotensin-2 receptor(RAT)
Johnson & Johnson Pharmaceutical Research & Development
Curated by ChEMBL
LigandPNGBDBM50320469(Ac-[CFWKFC]-NH2 | CHEMBL1163471)
Affinity DataKi:  17nM. Assay description: Displacement of [125I]U2 from rat urotensin 2 receptor expressed in CHO cells
In DepthDetails ArticlePubMed
TargetUrotensin-2 receptor(RAT)
Johnson & Johnson Pharmaceutical Research & Development
Curated by ChEMBL
LigandPNGBDBM50320469(Ac-[CFWKFC]-NH2 | CHEMBL1163471)
Affinity DataEC50:  2.10nM. Assay description: Agonist activity at rat urotensin 2 receptor expressed in CHO cells assessed as calcium mobilization by FLIPR
In DepthDetails ArticlePubMed