BDBM50320470 (4R,7S,10S,13S,16S,19R)-19-acetamido-10-(4-aminobutyl)-16-benzyl-7-(4-hydroxybenzyl)-13-(naphthalen-2-ylmethyl)-6,9,12,15,18-pentaoxo-1,2-dithia-5,8,11,14,17-pentaazacycloicosane-4-carboxamide::CHEMBL1163475
SMILES CC(=O)N[C@H]1CSSC[C@H](NC(=O)[C@H](Cc2ccc(O)cc2)NC(=O)[C@H](CCCCN)NC(=O)[C@H](Cc2ccc3ccccc3c2)NC(=O)[C@H](Cc2ccccc2)NC1=O)C(N)=O
InChI Key InChIKey=HDWATWPWJNTOQQ-BGBFCPIGSA-N
Data  1 KI  1 EC50
  Tab Delimited (TSV)   2D SDfile   Computed 3D by Vconf -m prep SDfile
Find this compound or compounds like it in BindingDB:
Activity Spreadsheet -- Enzyme Inhibition Constant Data from BindingDB
Found 2 hits for monomerid = 50320470
TargetUrotensin-2 receptor(RAT)
Johnson & Johnson Pharmaceutical Research & Development
Curated by ChEMBL
LigandPNGBDBM50320470((4R,7S,10S,13S,16S,19R)-19-acetamido-10-(4-aminobu...)
Affinity DataKi:  200nM. Assay description: Displacement of [125I]U2 from rat urotensin 2 receptor expressed in CHO cells
In DepthDetails ArticlePubMed
TargetUrotensin-2 receptor(RAT)
Johnson & Johnson Pharmaceutical Research & Development
Curated by ChEMBL
LigandPNGBDBM50320470((4R,7S,10S,13S,16S,19R)-19-acetamido-10-(4-aminobu...)
Affinity DataEC50:  31nM. Assay description: Agonist activity at rat urotensin 2 receptor expressed in CHO cells assessed as calcium mobilization by FLIPR
In DepthDetails ArticlePubMed