BDBM50320703 5-Benzoyl-8-methoxy-2,3,4,5-tetrahydro-1H-pyrido[4,3-b]indole hydrochloride::CHEMBL1164245
SMILES COc1ccc2n(C(=O)c3ccccc3)c3CCNCc3c2c1
InChI Key InChIKey=SSJCYIYLFOYNBK-UHFFFAOYSA-N
Data  2 IC50
  Tab Delimited (TSV)   2D SDfile   Computed 3D by Vconf -m prep SDfile
Find this compound or compounds like it in BindingDB:
Activity Spreadsheet -- Enzyme Inhibition Constant Data from BindingDB
Found 2 hits for monomerid = 50320703
TargetProstaglandin G/H synthase 2(Homo sapiens (Human))
Universit£
Curated by ChEMBL
LigandPNGBDBM50320703(5-Benzoyl-8-methoxy-2,3,4,5-tetrahydro-1H-pyrido[4...)
Affinity DataIC50:  8.76E+4nM. Assay description: Inhibition of COX2 in human whole blood assessed as inhibition of 12-hydroxyheptadecatrienoic acid production by HPLC method
In DepthDetails ArticlePubMed
TargetProstaglandin G/H synthase 1(Homo sapiens (Human))
Universit£
Curated by ChEMBL
LigandPNGBDBM50320703(5-Benzoyl-8-methoxy-2,3,4,5-tetrahydro-1H-pyrido[4...)
Affinity DataIC50:  6.00E+3nM. Assay description: Inhibition of COX1 in human whole blood assessed as inhibition of 12-hydroxyheptadecatrienoic acid production by HPLC method
In DepthDetails ArticlePubMed