BDBM50323808 6-Methoxy-2-(4-methyl-1,4-diazepan-1-yl)-N-(1-methylpiperidin-4-yl)-7-(3-(pyrrolidin-1-yl)propoxy)quinazolin-4-amine::CHEMBL1213903
SMILES COc1cc2c(NC3CCN(C)CC3)nc(nc2cc1OCCCN1CCCC1)N1CCCN(C)CC1
InChI Key InChIKey=ILCODGITBOXMED-UHFFFAOYSA-N
Data  4 IC50
  Tab Delimited (TSV)   2D SDfile   Computed 3D by Vconf -m prep SDfile
Find this compound or compounds like it in BindingDB:
Activity Spreadsheet -- Enzyme Inhibition Constant Data from BindingDB
Found 4 hits for monomerid = 50323808
TargetHistone-lysine N-methyltransferase EHMT2(Homo sapiens (Human))
University Of North Carolina At Chapel Hill
Curated by ChEMBL
LigandPNGBDBM50323808(6-Methoxy-2-(4-methyl-1,4-diazepan-1-yl)-N-(1-meth...)
Affinity DataIC50:  1.10E+4nM. Assay description: Inhibition of methyl transferase activity of G9a assessed as inhibition of H3K9 methylation by chemiluminescence based oxygen tunneling assay
In DepthDetails ArticlePubMed
TargetHistone-lysine N-methyltransferase EHMT2(Homo sapiens (Human))
University Of North Carolina At Chapel Hill
Curated by ChEMBL
LigandPNGBDBM50323808(6-Methoxy-2-(4-methyl-1,4-diazepan-1-yl)-N-(1-meth...)
Affinity DataIC50:  2.20E+3nM. Assay description: Inhibition of G9a in human MDA-MB-231 cells assessed as reduction of H3K9me2 after 48 hrs by In-Cell Western assay
In DepthDetails ArticlePubMed
TargetHistone-lysine N-methyltransferase EHMT2(Homo sapiens (Human))
University Of North Carolina At Chapel Hill
Curated by ChEMBL
LigandPNGBDBM50323808(6-Methoxy-2-(4-methyl-1,4-diazepan-1-yl)-N-(1-meth...)
Affinity DataIC50:  8.00E+3nM. Assay description: Activity at methyl transferase activity G9a by enzyme coupled S-adenocylehomocystein detection assay
In DepthDetails ArticlePubMed
TargetHistone-lysine N-methyltransferase EHMT2(Homo sapiens (Human))
University Of North Carolina At Chapel Hill
Curated by ChEMBL
LigandPNGBDBM50323808(6-Methoxy-2-(4-methyl-1,4-diazepan-1-yl)-N-(1-meth...)
Affinity DataIC50:  8nM. Assay description: Inhibition of G9a assessed as hydrolysis of S-adenosyl-L-homocysteine after 2 mins by SAHH-coupled fluorescence assay
In DepthDetails ArticlePubMed