BDBM50324186 (+/-)-4-[1-(4-Cyanophenyl)-5-(2-furyl)-4,5-dihydro-1H-pyrazol-3-yl]benzoic Acid::CHEMBL1214968
SMILES OC(=O)c1ccc(cc1)C1=NN(C(C1)c1ccco1)c1ccc(cc1)C#N
InChI Key InChIKey=LWBVSMGMZQVVHY-UHFFFAOYSA-N
Data  1 IC50
  Tab Delimited (TSV)   2D SDfile   Computed 3D by Vconf -m prep SDfile
Find this compound or compounds like it in BindingDB:
Activity Spreadsheet -- Enzyme Inhibition Constant Data from BindingDB
Found 1 hit for monomerid = 50324186
TargetMineralocorticoid receptor(Homo sapiens (Human))
Pfizer
Curated by ChEMBL
LigandPNGBDBM50324186((+/-)-4-[1-(4-Cyanophenyl)-5-(2-furyl)-4,5-dihydro...)
Affinity DataIC50:  410nM. Assay description: Antagonist activity at Gal4-tagged mineralocorticoid receptor expressed in human Huh7 cells by luciferase reporter gene assay
In DepthDetails ArticlePubMed