BDBM50325426 (R)-(2-(4-(5-cyclopropyl-1H-pyrazol-3-ylamino)pyrrolo[1,2-f][1,2,4]triazin-2-yl)pyrrolidin-1-yl)(6-fluoropyridin-3-yl)methanone::CHEMBL1222711::N-(5-cyclopropyl-1H-pyrazol-3-yl)-2-{(2R)-1-[(6-fluoropyridin-3-yl)carbonyl]pyrrolidin-2-yl}pyrrolo[2,1-f][1,2,4]triazin-4-amine
SMILES Fc1ccc(cn1)C(=O)N1CCC[C@@H]1c1nc(Nc2cc(n[nH]2)C2CC2)c2cccn2n1
InChI Key InChIKey=XXGADWBTSMHVDF-MRXNPFEDSA-N
Data  1 IC50
PDB links: 1 PDB ID matches this monomer.
  Tab Delimited (TSV)   2D SDfile   Computed 3D by Vconf -m prep SDfile
Find this compound or compounds like it in BindingDB:
Activity Spreadsheet -- Enzyme Inhibition Constant Data from BindingDB
Found 1 hit for monomerid = 50325426
TargetInsulin-like growth factor 1 receptor(Homo sapiens (Human))
Bristol-Myers Squibb Research And Development
Curated by ChEMBL
LigandPNGBDBM50325426((R)-(2-(4-(5-cyclopropyl-1H-pyrazol-3-ylamino)pyrr...)
Affinity DataIC50:  8.40E+3nM. Assay description: Inhibition of IGF1R