BDBM50326026 CHEMBL1240613
SMILES [#6]-[#6]-[#6@@H](-[#6])-[#6@@H]-1-[#7]-[#6](=O)-[#6@@H]-2-[#6]-[#6]-[#6]-[#7]-2-[#6](=O)-[#6@@H](-[#6]-[#6](-[#6])-[#6])-[#7]-[#6](=O)-[#6@@H]-2-[#6]-[#16]-[#6]-c3cc(-[#6]-[#16]-[#6]-[#6@H](-[#7]-[#6](=O)-[#6@H](-[#6])-[#7])-[#6](=O)-[#7]-4-[#6]-[#6]-[#6]-[#6@H]-4-[#6](=O)-[#7]-[#6@@H](-[#6]-[#6]-[#6]\[#7]=[#6](\[#7])-[#7])-[#6](=O)-[#7]-[#6@@H](-[#6@H](-[#6])-[#6]-[#6])-[#6](=O)-[#7]-[#6@@H](-[#6]-[#6]-[#6](-[#8])=O)-[#6](=O)-[#7]-[#6]-[#6](=O)-[#7]-[#6@@H](-[#6]-c4ccccc4)-[#6](=O)-[#7]-2)cc(-[#6]-[#16]-[#6]-[#6@H](-[#7]-[#6](=O)-[#6@@H](-[#6]-[#6](-[#8])=O)-[#7]-[#6](=O)-[#6@@H](-[#6]-[#8])-[#7]-[#6](=O)-[#6@H](-[#6]-c2ccccc2)-[#7]-[#6]-1=O)-[#6](=O)-[#7]-[#6]-[#6](-[#7])=O)c3
InChI Key InChIKey=WVEUROXPEHTIBM-USIGVULVSA-N
Data  1 IC50
  Tab Delimited (TSV)   2D SDfile   Computed 3D by Vconf -m prep SDfile
Find this compound or compounds like it in BindingDB:
Activity Spreadsheet -- Enzyme Inhibition Constant Data from BindingDB
Found 1 hit for monomerid = 50326026
TargetCathepsin G(Homo sapiens (Human))
Laboratory Of Molecular Biology, Medical Research Council
Curated by ChEMBL
LigandPNGBDBM50326026(CHEMBL1240613)
Affinity DataIC50:  1.00E+3nM. Assay description: Inhibition of human cathepsin G using N-Suc-Ala-Ala-Phe-Pro-pNA substrate by calorimetric assay
In DepthDetails ArticlePubMed