BDBM50326294 3-(1-(1H-Imidazole-4-yl)-2-(4-trifluoromeethylphenylthio)ethyl)-pyridine::CHEMBL1243365
SMILES FC(F)(F)c1ccc(SCC(c2cnc[nH]2)c2cccnc2)cc1
InChI Key InChIKey=DZWHJWIZJPROQA-UHFFFAOYSA-N
Data  1 KI  1 EC50
  Tab Delimited (TSV)   2D SDfile   Computed 3D by Vconf -m prep SDfile
Find this compound or compounds like it in BindingDB:
Activity Spreadsheet -- Enzyme Inhibition Constant Data from BindingDB
Found 2 hits for monomerid = 50326294
TargetHistamine H3 receptor(Homo sapiens (Human))
Meiji Seika Kaisha
Curated by ChEMBL
LigandPNGBDBM50326294(3-(1-(1H-Imidazole-4-yl)-2-(4-trifluoromeethylphen...)
Affinity DataKi:  120nM. Assay description: Displacement of [3H]-(R)-alpha-methylhistamine from human histamine H3 receptor expressed in CHO cells by liquid scintillation counting
In DepthDetails ArticlePubMed
TargetHistamine H3 receptor(Homo sapiens (Human))
Meiji Seika Kaisha
Curated by ChEMBL
LigandPNGBDBM50326294(3-(1-(1H-Imidazole-4-yl)-2-(4-trifluoromeethylphen...)
Affinity DataEC50:  67nM. Assay description: Agonist activity at human histamine H3 receptor expressed in CHO cells assessed as [35S]GTPgammaS binding
In DepthDetails ArticlePubMed