BDBM50326534 CHEMBL1240537::furan-3-yl(4-(methylsulfonyl)phenyl)methanone
SMILES CS(=O)(=O)c1ccc(cc1)C(=O)c1ccoc1
InChI Key InChIKey=ULFFSZMVURLRPK-UHFFFAOYSA-N
Data  4 IC50
  Tab Delimited (TSV)   2D SDfile   Computed 3D by Vconf -m prep SDfile
Find this compound or compounds like it in BindingDB:
Activity Spreadsheet -- Enzyme Inhibition Constant Data from BindingDB
Found 4 hits for monomerid = 50326534
TargetProstaglandin G/H synthase 1(Ovis aries (Sheep))
Universitat De Barcelona
Curated by ChEMBL
LigandPNGBDBM50326534(CHEMBL1240537 | furan-3-yl(4-(methylsulfonyl)pheny...)
Affinity DataIC50:  1.50E+5nM. Assay description: Inhibition of sheep COX1 by spectrophotometry
In DepthDetails ArticlePubMed
TargetProstaglandin G/H synthase 2(Ovis aries (Sheep))
Universitat De Barcelona
Curated by ChEMBL
LigandPNGBDBM50326534(CHEMBL1240537 | furan-3-yl(4-(methylsulfonyl)pheny...)
Affinity DataIC50:  710nM. Assay description: Inhibition of ovine COX2 assessed as reduction in PGH2 production by enzyme immunoassay
In DepthDetails ArticlePubMed
TargetProstaglandin G/H synthase 1(Ovis aries (Sheep))
Universitat De Barcelona
Curated by ChEMBL
LigandPNGBDBM50326534(CHEMBL1240537 | furan-3-yl(4-(methylsulfonyl)pheny...)
Affinity DataIC50:  180nM. Assay description: Inhibition of ovine COX1 assessed as reduction in PGH2 production by enzyme immunoassay
In DepthDetails ArticlePubMed
TargetProstaglandin G/H synthase 2(Ovis aries (Sheep))
Universitat De Barcelona
Curated by ChEMBL
LigandPNGBDBM50326534(CHEMBL1240537 | furan-3-yl(4-(methylsulfonyl)pheny...)
Affinity DataIC50:  4.10E+3nM. Assay description: Inhibition of sheep COX2 by spectrophotometry
In DepthDetails ArticlePubMed