BDBM50327232 4,5-diphenyl-2-(3-(piperidin-1-yl)propoxy)thiazole::CHEMBL1257584::ST-1025
SMILES C(COc1nc(c(s1)-c1ccccc1)-c1ccccc1)CN1CCCCC1
InChI Key InChIKey=QRGQBMVHLMCOKC-UHFFFAOYSA-N
Data  2 KI
  Tab Delimited (TSV)   2D SDfile   Computed 3D by Vconf -m prep SDfile
Find this compound or compounds like it in BindingDB:
Activity Spreadsheet -- Enzyme Inhibition Constant Data from BindingDB
Found 2 hits for monomerid = 50327232
TargetHistamine H3 receptor(Homo sapiens (Human))
Johann Wolfgang Goethe University
Curated by ChEMBL
LigandPNGBDBM50327232(4,5-diphenyl-2-(3-(piperidin-1-yl)propoxy)thiazole...)
Affinity DataKi:  11.2nM. Assay description: Displacement of [125I]iodoproxyfan human histamine H3 receptor
In DepthDetails ArticlePubMed
TargetHistamine H3 receptor(Homo sapiens (Human))
Johann Wolfgang Goethe University
Curated by ChEMBL
LigandPNGBDBM50327232(4,5-diphenyl-2-(3-(piperidin-1-yl)propoxy)thiazole...)
Affinity DataKi:  11.2nM. Assay description: Displacement of [125I]Iodoproxyfan from human histamine H3 receptor expressed in HEK293 cells
In DepthDetails ArticlePubMed