BDBM50327590 7-fluoro-6-(4-(4-(8-fluoronaphthalen-1-yl)piperazin-1-yl)butoxy)isoindolin-1-one::CHEMBL1258199
SMILES Fc1cccc2cccc(N3CCN(CCCCOc4ccc5CNC(=O)c5c4F)CC3)c12
InChI Key InChIKey=AZXRALDDIQIHKZ-UHFFFAOYSA-N
Data  5 KI
  Tab Delimited (TSV)   2D SDfile   Computed 3D by Vconf -m prep SDfile
Find this compound or compounds like it in BindingDB:
Activity Spreadsheet -- Enzyme Inhibition Constant Data from BindingDB
Found 5 hits for monomerid = 50327590
Target5-hydroxytryptamine receptor 2A(Homo sapiens (Human))
Pfizer
Curated by ChEMBL
LigandPNGBDBM50327590(7-fluoro-6-(4-(4-(8-fluoronaphthalen-1-yl)piperazi...)
Affinity DataKi:  0.568nM. Assay description: Binding affinity to human 5HT2A receptor
In DepthDetails ArticlePubMed
Target5-hydroxytryptamine receptor 1A(Homo sapiens (Human))
Pfizer
Curated by ChEMBL
LigandPNGBDBM50327590(7-fluoro-6-(4-(4-(8-fluoronaphthalen-1-yl)piperazi...)
Affinity DataKi:  2.09nM. Assay description: Binding affinity to human 5HT1A receptor expressed in HeLa cells by scintillation proximity assay
In DepthDetails ArticlePubMed
TargetD(2) dopamine receptor(Homo sapiens (Human))
Pfizer
Curated by ChEMBL
LigandPNGBDBM50327590(7-fluoro-6-(4-(4-(8-fluoronaphthalen-1-yl)piperazi...)
Affinity DataKi:  35.2nM. Assay description: Displacement of [3H]-Spiperone from human dopamine D2L receptor expressed in CHO cells
In DepthDetails ArticlePubMed
TargetSodium-dependent serotonin transporter(Homo sapiens (Human))
Pfizer
Curated by ChEMBL
LigandPNGBDBM50327590(7-fluoro-6-(4-(4-(8-fluoronaphthalen-1-yl)piperazi...)
Affinity DataKi:  48.1nM. Assay description: Displacement of [3H]-citalopram from human serotonin transporter expressed in HEK 293 cells by scintillation proximity assay
In DepthDetails ArticlePubMed
TargetSodium-dependent serotonin transporter(Homo sapiens (Human))
Pfizer
Curated by ChEMBL
LigandPNGBDBM50327590(7-fluoro-6-(4-(4-(8-fluoronaphthalen-1-yl)piperazi...)
Affinity DataKi:  57.2nM. Assay description: Displacement of [3H]-citalopram from human serotonin transporter expressed in HEK 293 cells
In DepthDetails ArticlePubMed