BDBM50327599 6-(4-(4-(6-fluoronaphthalen-1-yl)piperazin-1-yl)butoxy)isoindolin-1-one::CHEMBL1257144
SMILES Fc1ccc2c(cccc2c1)N1CCN(CCCCOc2ccc3CNC(=O)c3c2)CC1
InChI Key InChIKey=MKHIWRPHVPOJRQ-UHFFFAOYSA-N
Data  4 KI
  Tab Delimited (TSV)   2D SDfile   Computed 3D by Vconf -m prep SDfile
Find this compound or compounds like it in BindingDB:
Activity Spreadsheet -- Enzyme Inhibition Constant Data from BindingDB
Found 4 hits for monomerid = 50327599
Target5-hydroxytryptamine receptor 2A(Homo sapiens (Human))
Pfizer
Curated by ChEMBL
LigandPNGBDBM50327599(6-(4-(4-(6-fluoronaphthalen-1-yl)piperazin-1-yl)bu...)
Affinity DataKi:  9.53nM. Assay description: Binding affinity to human 5HT2A receptor
In DepthDetails ArticlePubMed
Target5-hydroxytryptamine receptor 1A(Homo sapiens (Human))
Pfizer
Curated by ChEMBL
LigandPNGBDBM50327599(6-(4-(4-(6-fluoronaphthalen-1-yl)piperazin-1-yl)bu...)
Affinity DataKi:  13.4nM. Assay description: Displacement of [3H]-8-OH-DPAT from human 5HT1A receptor expressed in HeLa cells
In DepthDetails ArticlePubMed
TargetD(2) dopamine receptor(Homo sapiens (Human))
Pfizer
Curated by ChEMBL
LigandPNGBDBM50327599(6-(4-(4-(6-fluoronaphthalen-1-yl)piperazin-1-yl)bu...)
Affinity DataKi:  58nM. Assay description: Displacement of [3H]-Spiperone from human dopamine D2L receptor expressed in CHO cells
In DepthDetails ArticlePubMed
TargetPotassium voltage-gated channel subfamily H member 2(Homo sapiens (Human))
Pfizer
Curated by ChEMBL
LigandPNGBDBM50327599(6-(4-(4-(6-fluoronaphthalen-1-yl)piperazin-1-yl)bu...)
Affinity DataKi:  969nM. Assay description: Displacement of [3H]dofetilide from human ERG
In DepthDetails ArticlePubMed