BDBM50328610 3-methyl-1-(4-(4-propionylpiperazin-1-yl)-3-(trifluoromethyl)phenyl)-9-(quinolin-3-yl)benzo[h][1,6]naphthyridin-2(1H)-one::CHEMBL1256463
SMILES CCC(=O)N1CCN(CC1)c1ccc(cc1C(F)(F)F)-n1c2c(cnc3ccc(cc23)-c2cnc3ccccc3c2)cc(C)c1=O
InChI Key InChIKey=BTUUFMWSTSOSTK-UHFFFAOYSA-N
Data  2 IC50
  Tab Delimited (TSV)   2D SDfile   Computed 3D by Vconf -m prep SDfile
Find this compound or compounds like it in BindingDB:
Activity Spreadsheet -- Enzyme Inhibition Constant Data from BindingDB
Found 2 hits for monomerid = 50328610
TargetSerine/threonine-protein kinase mTOR(Mus musculus (Mouse))
Dana-Farber Cancer Institute
Curated by ChEMBL
LigandPNGBDBM50328610(3-methyl-1-(4-(4-propionylpiperazin-1-yl)-3-(trifl...)
Affinity DataIC50:  100nM. Assay description: Inhibition of mTOR in p53-deficient MEF assessed as phosphorylation of S6K1 at Thr389 by immunoblotting
In DepthDetails ArticlePubMed
TargetSerine/threonine-protein kinase mTOR(Homo sapiens (Human))
Dana-Farber Cancer Institute
Curated by ChEMBL
LigandPNGBDBM50328610(3-methyl-1-(4-(4-propionylpiperazin-1-yl)-3-(trifl...)
Affinity DataIC50:  27nM. Assay description: Inhibition of human mTOR complex 1 after 30 mins by FRET assay
In DepthDetails ArticlePubMed