BDBM50328677 CHEMBL1255965
SMILES NCc1ccc(CSC[C@H]2O[C@H]3O[C@@H]4[C@@H](CSCc5ccc(CN)cc5)O[C@@H](O[C@@H]5[C@@H](CSCc6ccc(CN)cc6)O[C@@H](O[C@@H]6[C@@H](CSCc7ccc(CN)cc7)O[C@@H](O[C@@H]7[C@@H](CSCc8ccc(CN)cc8)O[C@@H](O[C@@H]8[C@@H](CSCc9ccc(CN)cc9)O[C@@H](O[C@@H]9[C@@H](CSCc%10ccc(CN)cc%10)O[C@@H](O[C@H]2[C@H](O)[C@H]3O)[C@H](O)[C@H]9O)[C@H](O)[C@H]8O)[C@H](O)[C@H]7O)[C@H](O)[C@H]6O)[C@H](O)[C@H]5O)[C@H](O)[C@H]4O)cc1
InChI Key InChIKey=XZDFKSAPEJVFDO-HUSZHXGFSA-N
Data  1 IC50
  Tab Delimited (TSV)   2D SDfile   Computed 3D by Vconf -m prep SDfile
Find this compound or compounds like it in BindingDB:
Activity Spreadsheet -- Enzyme Inhibition Constant Data from BindingDB
Found 1 hit for monomerid = 50328677
TargetLethal factor(Bacillus anthracis)
National Institute Of Allergy And Infectious Diseases
Curated by ChEMBL
LigandPNGBDBM50328677(CHEMBL1255965)
Affinity DataIC50:  700nM. Assay description: Inhibition of Bacillus anthracis lethal factor
In DepthDetails ArticlePubMed