BDBM50329412 CHEMBL1270423::N-[2-[4-(3-Cyanopyridin-2-yl)piperazin-1-yl]ethyl]-4-fluorobenzamide
SMILES Fc1ccc(cc1)C(=O)NCCN1CCN(CC1)c1ncccc1C#N
InChI Key InChIKey=DJWRUQHQYQAMBK-UHFFFAOYSA-N
Data  1 KI
  Tab Delimited (TSV)   2D SDfile   Computed 3D by Vconf -m prep SDfile
Find this compound or compounds like it in BindingDB:
Activity Spreadsheet -- Enzyme Inhibition Constant Data from BindingDB
Found 1 hit for monomerid = 50329412
TargetD(4) dopamine receptor(RAT)
Universita` Degli Studi Di Bari A Moro
Curated by ChEMBL
LigandPNGBDBM50329412(CHEMBL1270423 | N-[2-[4-(3-Cyanopyridin-2-yl)piper...)
Affinity DataKi:  0.930nM. Assay description: Displacement of [3H]MSP from rat dopamine D4 receptor expressed in HEK293 cells after 90 mins by scintillation counting
In DepthDetails ArticlePubMed