BDBM50329803 (Z)-3-((4-(2-(diethylamino)ethylcarbamoyl)phenylamino)(phenyl)methylene)-N-ethyl-2-oxoindoline-6-carboxamide::CHEMBL1271524
SMILES CCNC(=O)c1ccc2C(C(=Nc3ccc(cc3)C(=O)NCCN(CC)CC)c3ccccc3)C(=O)Nc2c1
InChI Key InChIKey=MJWGUTNEFRSROZ-UHFFFAOYSA-N
Data  2 IC50  1 EC50
  Tab Delimited (TSV)   2D SDfile   Computed 3D by Vconf -m prep SDfile
Find this compound or compounds like it in BindingDB:
Activity Spreadsheet -- Enzyme Inhibition Constant Data from BindingDB
Found 3 hits for monomerid = 50329803
TargetTGF-beta receptor type-1(Homo sapiens (Human))
Boehringer Ingelheim Pharma
Curated by ChEMBL
LigandPNGBDBM50329803((Z)-3-((4-(2-(diethylamino)ethylcarbamoyl)phenylam...)
Affinity DataIC50:  33nM. Assay description: Inhibition of TGFbeta receptor
In DepthDetails ArticlePubMed
TargetTGF-beta receptor type-1(Homo sapiens (Human))
Boehringer Ingelheim Pharma
Curated by ChEMBL
LigandPNGBDBM50329803((Z)-3-((4-(2-(diethylamino)ethylcarbamoyl)phenylam...)
Affinity DataEC50:  505nM. Assay description: Inhibition of TGFbeta receptor in human HaCaT cells assessed as Smad phosphorylation by ELISA
In DepthDetails ArticlePubMed
TargetPlatelet-derived growth factor receptor alpha(Homo sapiens (Human))
Boehringer Ingelheim Pharma
Curated by ChEMBL
LigandPNGBDBM50329803((Z)-3-((4-(2-(diethylamino)ethylcarbamoyl)phenylam...)
Affinity DataIC50:  335nM. Assay description: Inhibition of PDGFRalpha
In DepthDetails ArticlePubMed