BDBM50329818 (Z)-3-((cyclohexylamino)(phenyl)methylene)-N-ethyl-N-methyl-2-oxoindoline-6-carboxamide::CHEMBL1272126
SMILES CCN(C)C(=O)c1ccc2C(C(=NC3CCCCC3)c3ccccc3)C(=O)Nc2c1
InChI Key InChIKey=IQUPWOCOYSFYIH-UHFFFAOYSA-N
Data  2 IC50  1 EC50
  Tab Delimited (TSV)   2D SDfile   Computed 3D by Vconf -m prep SDfile
Find this compound or compounds like it in BindingDB:
Activity Spreadsheet -- Enzyme Inhibition Constant Data from BindingDB
Found 3 hits for monomerid = 50329818
TargetTGF-beta receptor type-1(Homo sapiens (Human))
Boehringer Ingelheim Pharma
Curated by ChEMBL
LigandPNGBDBM50329818((Z)-3-((cyclohexylamino)(phenyl)methylene)-N-ethyl...)
Affinity DataIC50: >5.00E+4nM. Assay description: Inhibition of TGFbeta receptor
In DepthDetails ArticlePubMed
TargetTGF-beta receptor type-1(Homo sapiens (Human))
Boehringer Ingelheim Pharma
Curated by ChEMBL
LigandPNGBDBM50329818((Z)-3-((cyclohexylamino)(phenyl)methylene)-N-ethyl...)
Affinity DataEC50: >1.00E+4nM. Assay description: Inhibition of TGFbeta receptor in human HaCaT cells assessed as Smad phosphorylation by ELISA
In DepthDetails ArticlePubMed
TargetPlatelet-derived growth factor receptor alpha(Homo sapiens (Human))
Boehringer Ingelheim Pharma
Curated by ChEMBL
LigandPNGBDBM50329818((Z)-3-((cyclohexylamino)(phenyl)methylene)-N-ethyl...)
Affinity DataIC50: >5.00E+3nM. Assay description: Inhibition of PDGFRalpha
In DepthDetails ArticlePubMed