BDBM50331330 CHEMBL1289839::rac-1,1,1-trifluoro-2-(4-(o-tolylsulfonyl)phenyl)propan-2-ol
SMILES Cc1ccccc1S(=O)(=O)c1ccc(cc1)C(C)(O)C(F)(F)F
InChI Key InChIKey=KSIDACILJMPROB-UHFFFAOYSA-N
Data  2 IC50
  Tab Delimited (TSV)   2D SDfile   Computed 3D by Vconf -m prep SDfile
Find this compound or compounds like it in BindingDB:
Activity Spreadsheet -- Enzyme Inhibition Constant Data from BindingDB
Found 2 hits for monomerid = 50331330
Target11-beta-hydroxysteroid dehydrogenase 1(Homo sapiens (Human))
Amgen
Curated by ChEMBL
LigandPNGBDBM50331330(CHEMBL1289839 | rac-1,1,1-trifluoro-2-(4-(o-tolyls...)
Affinity DataIC50:  56nM. Assay description: Inhibition of human 11beta-HSD1 transfected in HEK293 cells by scintillation proximity assay
In DepthDetails ArticlePubMed
Target11-beta-hydroxysteroid dehydrogenase 1(Homo sapiens (Human))
Amgen
Curated by ChEMBL
LigandPNGBDBM50331330(CHEMBL1289839 | rac-1,1,1-trifluoro-2-(4-(o-tolyls...)
Affinity DataIC50:  4.40nM. Assay description: Inhibition of human 11beta-HSD1 by scintillation proximity assay
In DepthDetails ArticlePubMed